[cleanup][GridView] change deprecated method comm future to interface in

dune-common.
6 jobs for feature/communication-future-obj in 6 minutes and 20 seconds (queued for 2 seconds)
latest
Status Job ID Name Coverage
  Test
failed #76807
duneci
debian:10 clang-7-libcpp-17

00:05:24

failed #76806
duneci
debian:10 gcc-8-noassert-17

00:06:20

failed #76809
duneci
debian:9 clang-3.8-14

00:05:29

failed #76808
duneci
debian:9 gcc-6-14

00:04:40

failed #76810
duneci
ubuntu:16.04 gcc-5-14

00:01:21

failed #76811
duneci
ubuntu:18.04 clang-6-17

00:02:25

 
Name Stage Failure
failed
debian:10 gcc-8-noassert-17 Test
          ^~~~~~~~~~~~~~~~~~~~~~~~~~~~~~~~
compilation terminated.
make[2]: *** [lib/CMakeFiles/dunegrid.dir/build.make:76: lib/CMakeFiles/dunegrid.dir/__/dune/grid/onedgrid/onedgridfactory.cc.o] Error 1
make[1]: *** [CMakeFiles/Makefile2:3969: lib/CMakeFiles/dunegrid.dir/all] Error 2
make[1]: *** [CMakeFiles/Makefile2:4043: lib/CMakeFiles/dunealbertagrid_2d.dir/all] Error 2
make: *** [Makefile:163: all] Error 2
--- Failed to build dune-grid ---
Terminating dunecontrol due to previous errors!
ERROR: Job failed: exit code 1
failed
debian:9 clang-3.8-14 Test
lib/CMakeFiles/dunealbertagrid_1d.dir/build.make:110: recipe for target 'lib/CMakeFiles/dunealbertagrid_1d.dir/__/dune/grid/albertagrid/indexsets.cc.o' failed
make[2]: *** [lib/CMakeFiles/dunealbertagrid_1d.dir/__/dune/grid/albertagrid/indexsets.cc.o] Error 1
make[1]: *** [lib/CMakeFiles/dunealbertagrid_1d.dir/all] Error 2
CMakeFiles/Makefile2:4000: recipe for target 'lib/CMakeFiles/dunealbertagrid_1d.dir/all' failed
make: *** [all] Error 2
Makefile:160: recipe for target 'all' failed
--- Failed to build dune-grid ---
Terminating dunecontrol due to previous errors!
ERROR: Job failed: exit code 1
failed
debian:10 clang-7-libcpp-17 Test
#include <dune/common/parallel/future.hh>
^~~~~~~~~~~~~~~~~~~~~~~~~~~~~~~~
1 error generated.
make[2]: *** [lib/CMakeFiles/dunealbertagrid_3d.dir/build.make:89: lib/CMakeFiles/dunealbertagrid_3d.dir/__/dune/grid/albertagrid/indexsets.cc.o] Error 1
make[1]: *** [CMakeFiles/Makefile2:4006: lib/CMakeFiles/dunealbertagrid_3d.dir/all] Error 2
make: *** [Makefile:163: all] Error 2
--- Failed to build dune-grid ---
Terminating dunecontrol due to previous errors!
ERROR: Job failed: exit code 1
failed
debian:9 gcc-6-14 Test
CMakeFiles/Makefile2:3963: recipe for target 'lib/CMakeFiles/dunegrid.dir/all' failed
make[1]: *** [lib/CMakeFiles/dunegrid.dir/all] Error 2
CMakeFiles/Makefile2:4037: recipe for target 'lib/CMakeFiles/dunealbertagrid_2d.dir/all' failed
make[1]: *** [lib/CMakeFiles/dunealbertagrid_2d.dir/all] Error 2
make: *** [all] Error 2
Makefile:160: recipe for target 'all' failed
--- Failed to build dune-grid ---
Terminating dunecontrol due to previous errors!
ERROR: Job failed: exit code 1
failed
ubuntu:18.04 clang-6-17 Test
CMakeFiles/Makefile2:3926: recipe for target 'lib/CMakeFiles/dunealbertagrid_1d.dir/all' failed
make[1]: *** [lib/CMakeFiles/dunealbertagrid_1d.dir/all] Error 2
CMakeFiles/Makefile2:4000: recipe for target 'lib/CMakeFiles/dunealbertagrid_3d.dir/all' failed
make[1]: *** [lib/CMakeFiles/dunealbertagrid_3d.dir/all] Error 2
Makefile:162: recipe for target 'all' failed
make: *** [all] Error 2
--- Failed to build dune-grid ---
Terminating dunecontrol due to previous errors!
ERROR: Job failed: exit code 1
failed
ubuntu:16.04 gcc-5-14 Test
CMakeFiles/Makefile2:4037: recipe for target 'lib/CMakeFiles/dunealbertagrid_2d.dir/all' failed
make[1]: *** [lib/CMakeFiles/dunealbertagrid_2d.dir/all] Error 2
make[1]: *** [lib/CMakeFiles/dunealbertagrid_3d.dir/all] Error 2
CMakeFiles/Makefile2:3963: recipe for target 'lib/CMakeFiles/dunealbertagrid_3d.dir/all' failed
Makefile:160: recipe for target 'all' failed
make: *** [all] Error 2
--- Failed to build dune-grid ---
Terminating dunecontrol due to previous errors!
ERROR: Job failed: exit code 1