Only store tested app in CI artifacts

7 jobs for add-cli in 4 minutes and 33 seconds (queued for 1 second)
Status Name Job ID Coverage
  Build
passed build:all #241514

00:04:00

failed build:debug #241516
allowed to fail

00:02:16

passed build:tests #241515

00:00:57

 
  Test
passed test:all #241517

00:00:20

passed test:cli #241520

00:00:26

passed test:python #241519

00:00:29

passed test:run_simulations #241518

00:00:32

 
Name Stage Failure
failed
build:debug Build
      |            ^
cc1plus: all warnings being treated as errors
gmake[2]: *** [apps/CMakeFiles/structured2d_p2.dir/build.make:82: apps/CMakeFiles/structured2d_p2.dir/structured2d_p2.cc.o] Error 1
gmake[1]: *** [CMakeFiles/Makefile2:1739: apps/CMakeFiles/structured2d_p2.dir/all] Error 2
gmake: *** [Makefile:160: all] Error 2
--- Failed to build dune-structures ---
Terminating dunecontrol due to previous errors!
Cleaning up file based variables
ERROR: Job failed: exit code 1