Add new gmsh2d_p2 app to build artifacts

7 jobs for gmsh-reader-executable in 7 minutes and 44 seconds (queued for 3 seconds)
Status Name Job ID Coverage
  Build
passed build:all #248989

00:05:47

failed build:debug #248991
allowed to fail

00:02:24

passed build:tests #248990

00:01:21

 
  Test
passed test:all #248992

00:00:23

passed test:cli #248995

00:00:38

passed test:python #248994

00:00:31

passed test:run_simulations #248993

00:01:56

 
Name Stage Failure
failed
build:debug Build
      |                 ^~~~
cc1plus: all warnings being treated as errors
gmake[2]: *** [apps/CMakeFiles/gmsh2d_p2.dir/build.make:82: apps/CMakeFiles/gmsh2d_p2.dir/gmsh2d_p2.cc.o] Error 1
gmake[1]: *** [CMakeFiles/Makefile2:1776: apps/CMakeFiles/gmsh2d_p2.dir/all] Error 2
gmake: *** [Makefile:160: all] Error 2
--- Failed to build dune-structures ---
Terminating dunecontrol due to previous errors!
Cleaning up file based variables
ERROR: Job failed: exit code 1