Apply error estimate residual to both adjacent grid cells

7 jobs for h-refinement in 9 minutes and 56 seconds (queued for 8 seconds)
latest
Status Name Job ID Coverage
  Build
passed build:all #274847

00:06:16

failed build:debug #274849
allowed to fail

00:02:30

passed build:tests #274848

00:01:14

 
  Test
passed test:all #274850

00:00:24

passed test:cli #274853

00:00:36

passed test:python #274852

00:00:26

passed test:run_simulations #274851

00:03:40

 
Name Stage Failure
failed
build:debug Build
/builds/lukas.riedel/dune-structures/dune/structures/prestress.hh:280:23: error: comparison of integer expressions of different signedness: 'int' and 'std::vector<std::vector<Dune::FieldVector<double, 3> >, std::allocator<std::vector<Dune::FieldVector<double, 3> > > >::size_type' {aka 'long unsigned int'} [-Werror=sign-compare]
cc1plus: all warnings being treated as errors
gmake[2]: *** [apps/CMakeFiles/cell3d_p2.dir/build.make:82: apps/CMakeFiles/cell3d_p2.dir/cell3d_p2.cc.o] Error 1
gmake[1]: *** [CMakeFiles/Makefile2:1803: apps/CMakeFiles/cell3d_p2.dir/all] Error 2
gmake: *** [Makefile:160: all] Error 2
--- Failed to build dune-structures ---
Terminating dunecontrol due to previous errors!
Cleaning up file based variables
ERROR: Job failed: exit code 1