Add option to read and merge multiple values from simulation output

7 jobs for fibergrowth in 8 minutes and 25 seconds (queued for 21 seconds)
Status Name Job ID Coverage
  Build
passed build:all #284307

00:06:19

failed build:debug #284309
allowed to fail

00:02:54

passed build:tests #284308

00:01:49

 
  Test
passed test:all #284310

00:00:30

failed test:cli #284313

00:00:41

passed test:python #284312

00:00:57

passed test:run_simulations #284311

00:02:05

 
Name Stage Failure
failed
test:cli Test
  File "/duneci/modules/dune-common/build-cmake/dune-env/lib/python3.9/site-packages/pkg_resources/__init__.py", line 2449, in resolve
module = __import__(self.module_name, fromlist=['__name__'], level=0)
File "/builds/lukas.riedel/dune-structures/python/dune/structures/cli.py", line 10, in <module>
from dune.structures.fibergrowth.evaluate import (
File "/builds/lukas.riedel/dune-structures/python/dune/structures/fibergrowth/evaluate.py", line 13, in <module>
from skimage.feature import peak_local_max
ModuleNotFoundError: No module named 'skimage'
Cleaning up file based variables
ERROR: Job failed: exit code 1
failed
build:debug Build
/builds/lukas.riedel/dune-structures/dune/structures/prestress.hh:280:23: error: comparison of integer expressions of different signedness: 'int' and 'std::vector<std::vector<Dune::FieldVector<double, 3> >, std::allocator<std::vector<Dune::FieldVector<double, 3> > > >::size_type' {aka 'long unsigned int'} [-Werror=sign-compare]
cc1plus: all warnings being treated as errors
gmake[2]: *** [apps/CMakeFiles/cell3d_p2.dir/build.make:82: apps/CMakeFiles/cell3d_p2.dir/cell3d_p2.cc.o] Error 1
gmake[1]: *** [CMakeFiles/Makefile2:1803: apps/CMakeFiles/cell3d_p2.dir/all] Error 2
gmake: *** [Makefile:160: all] Error 2
--- Failed to build dune-structures ---
Terminating dunecontrol due to previous errors!
Cleaning up file based variables
ERROR: Job failed: exit code 1